Reaction Details
TargetLysine-specific demethylase 5A
LigandBDBM281073
Substrate/Competitorn/a
Meas. Tech.KDM5 Enzyme Assay
pH7±n/a
Temperature298.15±n/a K
IC50 0.094±n/a nM
Commentsextracted
Citation Lai, KWLiang, JZhang, BLabadie, SOrtwine, DDragovich, PKiefer, JGehling, VSHarmange, J Pyrrolidine amide compounds as histone demethylase inhibitors US Patent US10022354 Publication Date 7/17/2018
 
Lysine-specific demethylase 5A
Name:Lysine-specific demethylase 5A
Type:Protein
Mol. Mass.:192091.79
Organism:Homo sapiens (Human)
Description:P29375
Residue:1690
BDBM281073
NameBDBM281073
Synonyms:US10022354, Example 13
TypeSmall organic molecule
Emp. Form.C21H26N6O2
Mol. Mass.394.4701
SMILESCOc1cc(cc(n1)C1CCN(C1)C(=O)c1cc(n[nH]1)C(C)C)-c1cnn(C)c1