Reaction Details
TargetLysine-specific demethylase 5A
LigandBDBM281095
Substrate/Competitorn/a
Meas. Tech.KDM5 Enzyme Assay
pH7±n/a
Temperature298.15±n/a K
IC50 0.083±n/a nM
Commentsextracted
Citation Lai, KWLiang, JZhang, BLabadie, SOrtwine, DDragovich, PKiefer, JGehling, VSHarmange, J Pyrrolidine amide compounds as histone demethylase inhibitors US Patent US10022354 Publication Date 7/17/2018
 
Lysine-specific demethylase 5A
Name:Lysine-specific demethylase 5A
Type:Protein
Mol. Mass.:192091.79
Organism:Homo sapiens (Human)
Description:P29375
Residue:1690
BDBM281095
NameBDBM281095
Synonyms:US10022354, Example 35
TypeSmall organic molecule
Emp. Form.C15H25N5O2
Mol. Mass.307.3913
SMILESCC(C)NC(=O)NC1CCN(C1)C(=O)c1cc(n[nH]1)C(C)C