Reaction Details
TargetLysine-specific demethylase 5A
LigandBDBM281172
Substrate/Competitorn/a
Meas. Tech.KDM5 Enzyme Assay
pH7±n/a
Temperature298.15±n/a K
IC50 0.066±n/a nM
Commentsextracted
Citation Lai, KWLiang, JZhang, BLabadie, SOrtwine, DDragovich, PKiefer, JGehling, VSHarmange, J Pyrrolidine amide compounds as histone demethylase inhibitors US Patent US10022354 Publication Date 7/17/2018
 
Lysine-specific demethylase 5A
Name:Lysine-specific demethylase 5A
Type:Protein
Mol. Mass.:192091.79
Organism:Homo sapiens (Human)
Description:P29375
Residue:1690
BDBM281172
NameBDBM281172
Synonyms:US10022354, Example 112
TypeSmall organic molecule
Emp. Form.C16H22N6O2
Mol. Mass.330.3849
SMILESCC(C)c1cc([nH]n1)C(=O)N1CCC(C1)NC(=O)c1ccn(C)n1