Reaction Details
TargetSerine/threonine-protein kinase B-raf [V600E]
LigandBDBM103683
Substrate/Competitorn/a
Meas. Tech.Raf/Mek Amplified Luminescence Proximity Homogeneous Assay
pH7.5±0
IC50 0.08±n/a nM
Citation Costales, AQHuang, SJin, JXLiu, ZPecchi, SPoon, DTellew, J Compounds and compositions as protein kinase inhibitors US Patent US8563553 Publication Date 10/22/2013
 
Serine/threonine-protein kinase B-raf [V600E]
Name:Serine/threonine-protein kinase B-raf [V600E]
Type:n/a
Mol. Mass.:84474.98
Organism:Homo sapiens (Human)
Description:P15056 V600E
Residue:766
BDBM103683
NameBDBM103683
Synonyms:US8563553, 108
TypeSmall organic molecule
Emp. Form.C20H24ClFN6O2S
Mol. Mass.466.96
SMILESCCCS(=O)(=O)Nc1cc(Cl)cc(-c2[nH]c(nc2-c2ccnc(N)n2)C(C)(C)C)c1F