Reaction Details
TargetSerine/threonine-protein kinase B-raf [V600E]
LigandBDBM103715
Substrate/Competitorn/a
Meas. Tech.Raf/Mek Amplified Luminescence Proximity Homogeneous Assay
pH7.5±0
IC50 0.13±n/a nM
Citation Costales, AQHuang, SJin, JXLiu, ZPecchi, SPoon, DTellew, J Compounds and compositions as protein kinase inhibitors US Patent US8563553 Publication Date 10/22/2013
 
Serine/threonine-protein kinase B-raf [V600E]
Name:Serine/threonine-protein kinase B-raf [V600E]
Type:n/a
Mol. Mass.:84474.98
Organism:Homo sapiens (Human)
Description:P15056 V600E
Residue:766
BDBM103715
NameBDBM103715
Synonyms:US8563553, 140
TypeSmall organic molecule
Emp. Form.C24H30ClN7O4S
Mol. Mass.548.057
SMILESCCCS(=O)(=O)Nc1cccc(-c2[nH]c(nc2-c2ccnc(NC[C@H](C)NC(=O)OC)n2)C2CC2)c1Cl