Reaction Details
TargetSerine/threonine-protein kinase B-raf [V600E]
LigandBDBM103630
Substrate/Competitorn/a
Meas. Tech.Raf/Mek Amplified Luminescence Proximity Homogeneous Assay
pH7.5±0
IC50 0.3±n/a nM
Citation Costales, AQHuang, SJin, JXLiu, ZPecchi, SPoon, DTellew, J Compounds and compositions as protein kinase inhibitors US Patent US8563553 Publication Date 10/22/2013
 
Serine/threonine-protein kinase B-raf [V600E]
Name:Serine/threonine-protein kinase B-raf [V600E]
Type:n/a
Mol. Mass.:84474.98
Organism:Homo sapiens (Human)
Description:P15056 V600E
Residue:766
BDBM103630
NameBDBM103630
Synonyms:US8563553, 55
TypeSmall organic molecule
Emp. Form.C26H36ClN7O4S
Mol. Mass.578.127
SMILESCOC(=O)N[C@@H](C)CNc1nccc(n1)-c1nc([nH]c1-c1cc(Cl)cc(NS(=O)(=O)CC(C)C)c1)C(C)(C)C