Reaction Details
TargetSerine/threonine-protein kinase B-raf [V600E]
LigandBDBM103632
Substrate/Competitorn/a
Meas. Tech.Raf/Mek Amplified Luminescence Proximity Homogeneous Assay
pH7.5±0
IC50 0.1±n/a nM
Citation Costales, AQHuang, SJin, JXLiu, ZPecchi, SPoon, DTellew, J Compounds and compositions as protein kinase inhibitors US Patent US8563553 Publication Date 10/22/2013
 
Serine/threonine-protein kinase B-raf [V600E]
Name:Serine/threonine-protein kinase B-raf [V600E]
Type:n/a
Mol. Mass.:84474.98
Organism:Homo sapiens (Human)
Description:P15056 V600E
Residue:766
BDBM103632
NameBDBM103632
Synonyms:US8563553, 57
TypeSmall organic molecule
Emp. Form.C24H32ClN7O4S
Mol. Mass.550.073
SMILESCCS(=O)(=O)Nc1cc(Cl)cc(c1)-c1[nH]c(nc1-c1ccnc(NC[C@H](C)NC(=O)OC)n1)C(C)(C)C