Reaction Details
TargetSerine/threonine-protein kinase B-raf [V600E]
LigandBDBM103653
Substrate/Competitorn/a
Meas. Tech.Raf/Mek Amplified Luminescence Proximity Homogeneous Assay
pH7.5±0
IC50 0.43±n/a nM
Citation Costales, AQHuang, SJin, JXLiu, ZPecchi, SPoon, DTellew, J Compounds and compositions as protein kinase inhibitors US Patent US8563553 Publication Date 10/22/2013
 
Serine/threonine-protein kinase B-raf [V600E]
Name:Serine/threonine-protein kinase B-raf [V600E]
Type:n/a
Mol. Mass.:84474.98
Organism:Homo sapiens (Human)
Description:P15056 V600E
Residue:766
BDBM103653
NameBDBM103653
Synonyms:US8563553, 78
TypeSmall organic molecule
Emp. Form.C23H27ClFN7O4S
Mol. Mass.552.021
SMILESCCS(=O)(=O)Nc1cc(F)cc(-c2[nH]c(nc2-c2ccnc(NC[C@H](C)NC(=O)OC)n2)C2CC2)c1Cl