Reaction Details
TargetSerine/threonine-protein kinase B-raf [V600E]
LigandBDBM103654
Substrate/Competitorn/a
Meas. Tech.Raf/Mek Amplified Luminescence Proximity Homogeneous Assay
pH7.5±0
IC50 0.30±n/a nM
Citation Costales, AQHuang, SJin, JXLiu, ZPecchi, SPoon, DTellew, J Compounds and compositions as protein kinase inhibitors US Patent US8563553 Publication Date 10/22/2013
 
Serine/threonine-protein kinase B-raf [V600E]
Name:Serine/threonine-protein kinase B-raf [V600E]
Type:n/a
Mol. Mass.:84474.98
Organism:Homo sapiens (Human)
Description:P15056 V600E
Residue:766
BDBM103654
NameBDBM103654
Synonyms:US8563553, 79
TypeSmall organic molecule
Emp. Form.C24H27ClFN7O4S
Mol. Mass.564.032
SMILESCOC(=O)N[C@@H](C)CNc1nccc(n1)-c1nc([nH]c1-c1cc(F)cc(NS(=O)(=O)C2CC2)c1Cl)C1CC1