Reaction Details
TargetSerine/threonine-protein kinase B-raf [V600E]
LigandBDBM103655
Substrate/Competitorn/a
Meas. Tech.Raf/Mek Amplified Luminescence Proximity Homogeneous Assay
pH7.5±0
IC50 0.45±n/a nM
Citation Costales, AQHuang, SJin, JXLiu, ZPecchi, SPoon, DTellew, J Compounds and compositions as protein kinase inhibitors US Patent US8563553 Publication Date 10/22/2013
 
Serine/threonine-protein kinase B-raf [V600E]
Name:Serine/threonine-protein kinase B-raf [V600E]
Type:n/a
Mol. Mass.:84474.98
Organism:Homo sapiens (Human)
Description:P15056 V600E
Residue:766
BDBM103655
NameBDBM103655
Synonyms:US8563553, 80
TypeSmall organic molecule
Emp. Form.C24H29ClFN7O4S
Mol. Mass.566.048
SMILESCCCS(=O)(=O)Nc1ccc(F)c(-c2[nH]c(nc2-c2ccnc(NC[C@H](C)NC(=O)OC)n2)C2CC2)c1Cl