Reaction Details
TargetMuscarinic acetylcholine receptor M3
LigandBDBM6354
Substrate/Competitorn/a
Meas. Tech.Radioligand Binding Assay
Ki 0.1±n/a nM
Citation Hughes, ADChen, YJacobsen, JRStangeland, ELYen, R Diamide compounds having muscarinic receptor antagonist and β2 adrenergic receptor agonist activity US Patent US8551978 Publication Date 10/8/2013
 
Muscarinic acetylcholine receptor M3
Name:Muscarinic acetylcholine receptor M3
Type:Enzyme
Mol. Mass.:66151.03
Organism:Homo sapiens (Human)
Description:P20309
Residue:590
BDBM6354
NameBDBM6354
Synonyms:US8551978, I-1 US9394275, I-1 US9682957, I-1
Typen/a
Emp. Form.C44H50N6O7
Mol. Mass.774.9038
SMILESCN(CCCC(=O)Nc1ccc(CNC[C@H](O)c2ccc(O)c3[nH]c(=O)ccc23)cc1)C(=O)CCN1CCC(CC1)OC(=O)Nc1ccccc1-c1ccccc1