Reaction Details
TargetMuscarinic acetylcholine receptor M3
LigandBDBM38243
Substrate/Competitorn/a
Meas. Tech.Radioligand Binding Assay
Ki 0.1±n/a nM
Citation Hughes, ADChen, YJacobsen, JRStangeland, ELYen, R Diamide compounds having muscarinic receptor antagonist and β2 adrenergic receptor agonist activity US Patent US8551978 Publication Date 10/8/2013
 
Muscarinic acetylcholine receptor M3
Name:Muscarinic acetylcholine receptor M3
Type:Enzyme
Mol. Mass.:66151.03
Organism:Homo sapiens (Human)
Description:P20309
Residue:590
BDBM38243
NameBDBM38243
Synonyms:US8551978, I-13
Typen/a
Emp. Form.C46H54N6O7
Mol. Mass.802.957
SMILESC[C@@H](Cc1ccc(NC(=O)CCCN(C)C(=O)CCN2CCC(CC2)OC(=O)Nc2ccccc2-c2ccccc2)cc1)NC[C@H](O)c1ccc(O)c2[nH]c(=O)ccc12