Reaction Details
TargetMuscarinic acetylcholine receptor M3
LigandBDBM103740
Substrate/Competitorn/a
Meas. Tech.Radioligand Binding Assay
Ki 0.1±0.0 nM
Citation Hughes, ADChen, YJacobsen, JRStangeland, ELYen, R Diamide compounds having muscarinic receptor antagonist and β2 adrenergic receptor agonist activity US Patent US8551978 Publication Date 10/8/2013
 
Muscarinic acetylcholine receptor M3
Name:Muscarinic acetylcholine receptor M3
Type:Enzyme
Mol. Mass.:66151.03
Organism:Homo sapiens (Human)
Description:P20309
Residue:590
BDBM103740
NameBDBM103740
Synonyms:US8551978, 266 US9394275, I-4 US9682957, I-4
TypeSmall organic molecule
Emp. Form.C45H52N6O8
Mol. Mass.804.9298
SMILESCOc1cc(NC(=O)CCCN(C)C(=O)CCN2CCC(CC2)OC(=O)Nc2ccccc2-c2ccccc2)ccc1CNC[C@H](O)c1ccc(O)c2[nH]c(=O)ccc12