Reaction Details
TargetMuscarinic acetylcholine receptor M3
LigandBDBM103789
Substrate/Competitorn/a
Meas. Tech.Radioligand Binding Assay
Ki 0.1±0.0 nM
Citation Hughes, ADChen, YJacobsen, JRStangeland, ELYen, R Diamide compounds having muscarinic receptor antagonist and β2 adrenergic receptor agonist activity US Patent US8551978 Publication Date 10/8/2013
 
Muscarinic acetylcholine receptor M3
Name:Muscarinic acetylcholine receptor M3
Type:Enzyme
Mol. Mass.:66151.03
Organism:Homo sapiens (Human)
Description:P20309
Residue:590
BDBM103789
NameBDBM103789
Synonyms:US8551978, I-59 US9394275, I-59 US9682957, I-59
TypeSmall organic molecule
Emp. Form.C48H50N6O7
Mol. Mass.822.9466
SMILESCN(C(=O)CCN1CCC(CC1)OC(=O)Nc1ccccc1-c1ccccc1)c1cccc(CC(=O)Nc2ccc(CNC[C@H](O)c3ccc(O)c4[nH]c(=O)ccc34)cc2)c1