Reaction Details
TargetLysine-specific demethylase 4C [1-973]
LigandBDBM103843
Substrate/Competitorn/a
Meas. Tech.In vitro Hydroxylation Assays for PHD2 (AlphaScreen)
pH7.5±0
IC50 1.00e+5±n/a nM
Citation Chowdhury, RCandela-Lena, JIChan, MCGreenald, DJYeoh, KKTian, YMMcDonough, MATumber, ARose, NRConejo-Garcia, ADemetriades, MMathavan, SKawamura, ALee, MKvan Eeden, FPugh, CWRatcliffe, PJSchofield, CJ Selective Small Molecule Probes for the Hypoxia Inducible Factor (HIF) Prolyl Hydroxylases. ACS Chem Biol8:1488-96 (2013) 
 
Lysine-specific demethylase 4C [1-973]
Name:Lysine-specific demethylase 4C [1-973]
Type:PROTEIN
Mol. Mass.:110027.72
Organism:Homo sapiens (Human)
Description:Q9H3R0[1-973]
Residue:973
BDBM103843
NameBDBM103843
Synonyms:4HQ derivative 6
TypeSmall organic molecule
Emp. Form.C19H16N2O4
Mol. Mass.336.3413
SMILESOC(=O)CNC(=O)c1nc(Cc2ccccc2)c2ccccc2c1O