Reaction Details
TargetLysine-specific demethylase 4E
LigandBDBM103845
Substrate/Competitorn/a
Meas. Tech.In vitro Hydroxylation Assays for PHD2 (AlphaScreen)
pH7.5±0
IC50 9.9e+4±n/a nM
Citation Chowdhury, RCandela-Lena, JIChan, MCGreenald, DJYeoh, KKTian, YMMcDonough, MATumber, ARose, NRConejo-Garcia, ADemetriades, MMathavan, SKawamura, ALee, MKvan Eeden, FPugh, CWRatcliffe, PJSchofield, CJ Selective Small Molecule Probes for the Hypoxia Inducible Factor (HIF) Prolyl Hydroxylases. ACS Chem Biol8:1488-96 (2013) 
 
Lysine-specific demethylase 4E
Name:Lysine-specific demethylase 4E
Type:Enzyme
Mol. Mass.:56815.71
Organism:Homo sapiens (Human)
Description:B2RXH2
Residue:506
BDBM103845
NameBDBM103845
Synonyms:4HQ derivative 8
TypeSmall organic molecule
Emp. Form.C19H24N2O4
Mol. Mass.344.4049
SMILESCCCCCCCc1nc(C(=O)NCC(O)=O)c(O)c2ccccc12