Reaction Details
TargetLysine-specific demethylase 2A
LigandBDBM50193145
Substrate/Competitorn/a
Meas. Tech.In vitro Hydroxylation Assays for PHD2 (AlphaScreen)
pH7.5±0
IC50>2.0e+4±n/a nM
Citation Chowdhury, RCandela-Lena, JIChan, MCGreenald, DJYeoh, KKTian, YMMcDonough, MATumber, ARose, NRConejo-Garcia, ADemetriades, MMathavan, SKawamura, ALee, MKvan Eeden, FPugh, CWRatcliffe, PJSchofield, CJ Selective Small Molecule Probes for the Hypoxia Inducible Factor (HIF) Prolyl Hydroxylases. ACS Chem Biol8:1488-96 (2013) 
 
Lysine-specific demethylase 2A
Name:Lysine-specific demethylase 2A
Type:Enzyme Catalytic Domain
Mol. Mass.:132809.04
Organism:Homo sapiens (Human)
Description:n/a
Residue:1162
BDBM50193145
NameBDBM50193145
Synonyms:2-(1-chloro-4-hydroxyisoquinoline-3-carboxamido)acetic acid Isoquinoline 3 | N-[(1-CHLORO-4-HYDROXYISOQUINOLIN-3-YL)CARBONYL]GLYCINE
TypeSmall organic molecule
Emp. Form.C12H9ClN2O4
Mol. Mass.280.664
SMILESOC(=O)CNC(=O)c1nc(Cl)c2ccccc2c1O