Reaction Details
TargetLysine-specific demethylase 2A
LigandBDBM103843
Substrate/Competitorn/a
Meas. Tech.In vitro Hydroxylation Assays for PHD2 (AlphaScreen)
pH7.5±0
IC50 5.2e+4±n/a nM
Citation Chowdhury, RCandela-Lena, JIChan, MCGreenald, DJYeoh, KKTian, YMMcDonough, MATumber, ARose, NRConejo-Garcia, ADemetriades, MMathavan, SKawamura, ALee, MKvan Eeden, FPugh, CWRatcliffe, PJSchofield, CJ Selective Small Molecule Probes for the Hypoxia Inducible Factor (HIF) Prolyl Hydroxylases. ACS Chem Biol8:1488-96 (2013) 
 
Lysine-specific demethylase 2A
Name:Lysine-specific demethylase 2A
Type:Enzyme Catalytic Domain
Mol. Mass.:132809.04
Organism:Homo sapiens (Human)
Description:n/a
Residue:1162
BDBM103843
NameBDBM103843
Synonyms:4HQ derivative 6
TypeSmall organic molecule
Emp. Form.C19H16N2O4
Mol. Mass.336.3413
SMILESOC(=O)CNC(=O)c1nc(Cc2ccccc2)c2ccccc2c1O