Reaction Details
TargetLysine-specific demethylase 5C
LigandBDBM103846
Substrate/Competitorn/a
Meas. Tech.In vitro Hydroxylation Assays for PHD2 (AlphaScreen)
pH7.5±0
IC50>1.00e+5±n/a nM
Citation Chowdhury, RCandela-Lena, JIChan, MCGreenald, DJYeoh, KKTian, YMMcDonough, MATumber, ARose, NRConejo-Garcia, ADemetriades, MMathavan, SKawamura, ALee, MKvan Eeden, FPugh, CWRatcliffe, PJSchofield, CJ Selective Small Molecule Probes for the Hypoxia Inducible Factor (HIF) Prolyl Hydroxylases. ACS Chem Biol8:1488-96 (2013) 
 
Lysine-specific demethylase 5C
Name:Lysine-specific demethylase 5C
Type:PROTEIN
Mol. Mass.:175691.17
Organism:Homo sapiens (Human)
Description:P41229
Residue:1560
BDBM103846
NameBDBM103846
Synonyms:4HQ derivative 9
TypeSmall organic molecule
Emp. Form.C19H15BrN2O4
Mol. Mass.415.237
SMILESOC(=O)CNC(=O)c1nc(Cc2ccccc2)c2ccc(Br)cc2c1O