Reaction Details
TargetPoly [ADP-ribose] polymerase 1
LigandBDBM103556
Substrate/Competitorn/a
Meas. Tech.Enzymatic Assay
IC50 9.1e+3± 2.6e+3 nM
Citation Lindgren, AEKarlberg, TThorsell, AGHesse, MSpjut, SEkblad, TAndersson, CDPinto, AFWeigelt, JHottiger, MOLinusson, AElofsson, MSchüler, H PARP inhibitor with selectivity toward ADP-ribosyltransferase ARTD3/PARP3. ACS Chem Biol8:1698-703 (2013) 
 
Poly [ADP-ribose] polymerase 1
Name:Poly [ADP-ribose] polymerase 1
Type:n/a
Mol. Mass.:113114.22
Organism:Homo sapiens (Human)
Description:P09874
Residue:1014
BDBM103556
NameBDBM103556
Synonyms:ME0355
TypeSmall organic molecule
Emp. Form.C18H18N4O2
Mol. Mass.322.3611
SMILESC[C@H](NC(=O)CCc1nc2ccccc2c(=O)[nH]1)c1ccccn1