Reaction Details
Target3-phosphoinositide-dependent protein kinase 1
LigandBDBM103938
Substrate/Competitorn/a
Meas. Tech.Binding Assay
IC50 80±n/a nM
Citation Bearss, DJVankayalapati, HSorna, VWarner, SLSharma, S Substituted 3-(1H-benzo[d]imidazol-2-yl)-1H-indazole analogs as inhibitors of the PDK1 kinase US Patent US8569511 Publication Date 10/29/2013
 
3-phosphoinositide-dependent protein kinase 1
Name:3-phosphoinositide-dependent protein kinase 1
Type:Enzyme
Mol. Mass.:63157.65
Organism:Homo sapiens (Human)
Description:O15530
Residue:556
BDBM103938
NameBDBM103938
Synonyms:US8569511, 1
TypeSmall organic molecule
Emp. Form.C22H20F2N6O2
Mol. Mass.438.43
SMILESFC1(F)CC1C(=O)Nc1ccc2[nH]nc(-c3nc4ccc(cc4[nH]3)N3CCOCC3)c2c1