Reaction Details
Target3-phosphoinositide-dependent protein kinase 1
LigandBDBM103939
Substrate/Competitorn/a
Meas. Tech.Binding Assay
IC50 94±n/a nM
Citation Bearss, DJVankayalapati, HSorna, VWarner, SLSharma, S Substituted 3-(1H-benzo[d]imidazol-2-yl)-1H-indazole analogs as inhibitors of the PDK1 kinase US Patent US8569511 Publication Date 10/29/2013
 
3-phosphoinositide-dependent protein kinase 1
Name:3-phosphoinositide-dependent protein kinase 1
Type:Enzyme
Mol. Mass.:63157.65
Organism:Homo sapiens (Human)
Description:O15530
Residue:556
BDBM103939
NameBDBM103939
Synonyms:US8569511, 2
TypeSmall organic molecule
Emp. Form.C23H22F2N6O2
Mol. Mass.452.4566
SMILESCC1CN(CCO1)c1ccc2nc([nH]c2c1)-c1n[nH]c2ccc(NC(=O)C3CC3(F)F)cc12