Reaction Details
TargetMitogen-activated protein kinase 8
LigandBDBM16018
Substrate/Competitorn/a
IC50 68.0±10.3 nM
Citation Feng, YChambers, JWIqbal, SKoenig, MPark, HCherry, LHernandez, PFiguera-Losada, MLoGrasso, PV A small molecule bidentate-binding dual inhibitor probe of the LRRK2 and JNK kinases. ACS Chem Biol8:1747-54 (2013) 
 
Mitogen-activated protein kinase 8
Name:Mitogen-activated protein kinase 8
Type:Enzyme
Mol. Mass.:48297.57
Organism:Homo sapiens (Human)
Description:JNK-1 was purchased from Upstate Cell Signaling Solutions (formerly Upstate Biotechnology).
Residue:427
BDBM16018
NameBDBM16018
Synonyms:14,15-diazatetracyclo[7.6.1.0^{2,7}.0^{13,16}]hexadeca-1(15),2(7),3,5,9(16),10,12-heptaen-8-one ChemBiol10705 Compound 4 SP 600125 SP600125 dibenzo[cd,g]indazol-6(2H)-one
TypeSmall organic molecule
Emp. Form.C14H8N2O
Mol. Mass.220.2261
SMILESO=C1c2ccccc2-c2n[nH]c3cccc1c23