Reaction Details
TargetFucose-binding lectin PA-IIL
LigandBDBM103981
Substrate/Competitorn/a
IC50 1.578e+5± 5.28e+4 nM
Kd 7.1e+4±n/a nM
Citation Hauck, DJoachim, IFrommeyer, BVarrot, APhilipp, BMöller, HMMöller, AExner, TETitz, A Discovery of two classes of potent glycomimetic inhibitors of Pseudomonas aeruginosa LecB with distinct binding modes. ACS Chem Biol8:1775-84 (2013) 
 
Fucose-binding lectin PA-IIL
Name:Fucose-binding lectin PA-IIL
Type:Protein
Mol. Mass.:11857.84
Organism:Pseudomonas aeruginosa
Description:Q9HYN5
Residue:115
BDBM103981
NameBDBM103981
Synonyms:LecB Inhibitor Compound 1
TypeSmall organic molecule
Emp. Form.C7H14O6
Mol. Mass.194.1825
SMILESCOC1O[C@H](CO)[C@@H](O)C(O)[C@@H]1O