Reaction Details
TargetFucose-binding lectin PA-IIL
LigandBDBM103982
Substrate/Competitorn/a
IC50 2.74e+3± 1.44e+3 nM
EC50 697±0.0 nM
Citation Hauck, DJoachim, IFrommeyer, BVarrot, APhilipp, BMöller, HMMöller, AExner, TETitz, A Discovery of two classes of potent glycomimetic inhibitors of Pseudomonas aeruginosa LecB with distinct binding modes. ACS Chem Biol8:1775-84 (2013) 
 
Fucose-binding lectin PA-IIL
Name:Fucose-binding lectin PA-IIL
Type:Protein
Mol. Mass.:11857.84
Organism:Pseudomonas aeruginosa
Description:Q9HYN5
Residue:115
BDBM103982
NameBDBM103982
Synonyms:LecB Inhibitor Ligand 6
TypeSmall organic molecule
Emp. Form.C29H28N2O10S
Mol. Mass.596.605
SMILESCC1O[C@@H](OCCNC(=S)Nc2ccc(c(c2)C(O)=O)-c2c3ccc(O)cc3oc3cc(=O)ccc23)[C@@H](O)C(O)[C@@H]1O