Reaction Details
TargetFucose-binding lectin PA-IIL
LigandBDBM103987
Substrate/Competitorn/a
IC50 2.938e+5±n/a nM
Citation Hauck, DJoachim, IFrommeyer, BVarrot, APhilipp, BMöller, HMMöller, AExner, TETitz, A Discovery of two classes of potent glycomimetic inhibitors of Pseudomonas aeruginosa LecB with distinct binding modes. ACS Chem Biol8:1775-84 (2013) 
 
Fucose-binding lectin PA-IIL
Name:Fucose-binding lectin PA-IIL
Type:Protein
Mol. Mass.:11857.84
Organism:Pseudomonas aeruginosa
Description:Q9HYN5
Residue:115
BDBM103987
NameBDBM103987
Synonyms:LecB Inhibitor Triazoles 2e
TypeSmall organic molecule
Emp. Form.C16H21N3O5
Mol. Mass.335.355
SMILESCOC1O[C@H](Cn2cc(nn2)-c2ccc(C)cc2)[C@@H](O)C(O)[C@@H]1O