Reaction Details
TargetFucose-binding lectin PA-IIL
LigandBDBM103990
Substrate/Competitorn/a
IC50 2.813e+5± 1.238e+5 nM
Citation Hauck, DJoachim, IFrommeyer, BVarrot, APhilipp, BMöller, HMMöller, AExner, TETitz, A Discovery of two classes of potent glycomimetic inhibitors of Pseudomonas aeruginosa LecB with distinct binding modes. ACS Chem Biol8:1775-84 (2013) 
 
Fucose-binding lectin PA-IIL
Name:Fucose-binding lectin PA-IIL
Type:Protein
Mol. Mass.:11857.84
Organism:Pseudomonas aeruginosa
Description:Q9HYN5
Residue:115
BDBM103990
NameBDBM103990
Synonyms:LecB Inhibitor Amides 4a
TypeSmall organic molecule
Emp. Form.C9H17NO6
Mol. Mass.235.2344
SMILESCOC1O[C@H](CNC(C)=O)[C@@H](O)C(O)[C@@H]1O