Reaction Details
TargetFucose-binding lectin PA-IIL
LigandBDBM103998
Substrate/Competitorn/a
IC50 1.169e+5± 6.52e+4 nM
Citation Hauck, DJoachim, IFrommeyer, BVarrot, APhilipp, BMöller, HMMöller, AExner, TETitz, A Discovery of two classes of potent glycomimetic inhibitors of Pseudomonas aeruginosa LecB with distinct binding modes. ACS Chem Biol8:1775-84 (2013) 
 
Fucose-binding lectin PA-IIL
Name:Fucose-binding lectin PA-IIL
Type:Protein
Mol. Mass.:11857.84
Organism:Pseudomonas aeruginosa
Description:Q9HYN5
Residue:115
BDBM103998
NameBDBM103998
Synonyms:LecB Inhibitor Amines 3b
TypeSmall organic molecule
Emp. Form.C14H21N2O7
Mol. Mass.329.3252
SMILESCOC1O[C@H](CNCc2ccc(cc2)[N+](O)=O)[C@@H](O)C(O)[C@@H]1O