Reaction Details
TargetFucose-binding lectin PA-IIL
LigandBDBM104003
Substrate/Competitorn/a
IC50 4.97e+4± 3.69e+4 nM
Citation Hauck, DJoachim, IFrommeyer, BVarrot, APhilipp, BMöller, HMMöller, AExner, TETitz, A Discovery of two classes of potent glycomimetic inhibitors of Pseudomonas aeruginosa LecB with distinct binding modes. ACS Chem Biol8:1775-84 (2013) 
 
Fucose-binding lectin PA-IIL
Name:Fucose-binding lectin PA-IIL
Type:Protein
Mol. Mass.:11857.84
Organism:Pseudomonas aeruginosa
Description:Q9HYN5
Residue:115
BDBM104003
NameBDBM104003
Synonyms:LecB Inhibitor Sulfonamides 5b
TypeSmall organic molecule
Emp. Form.C14H21NO7S
Mol. Mass.347.384
SMILESCOC1O[C@H](CNS(=O)(=O)c2ccc(C)cc2)[C@@H](O)C(O)[C@@H]1O