Reaction Details
TargetEpithelial discoidin domain-containing receptor 1
LigandBDBM104009
Substrate/Competitorn/a
Meas. Tech.Enzyme Kinase Assay
EC50 86±n/a nM
Citation Kim, HGTan, LWeisberg, ELLiu, FCanning, PChoi, HGEzell, SAWu, HZhao, ZWang, JMandinova, AGriffin, JDBullock, ANLiu, QLee, SWGray, NS Discovery of a potent and selective DDR1 receptor tyrosine kinase inhibitor. ACS Chem Biol8:2145-50 (2013) 
 
Epithelial discoidin domain-containing receptor 1
Name:Epithelial discoidin domain-containing receptor 1
Type:Tyrosine-protein kinase
Mol. Mass.:101130.02
Organism:Homo sapiens (Human)
Description:Q08345
Residue:913
BDBM104009
NameBDBM104009
Synonyms:DDR1-IN-1
TypeSmall organic molecule
Emp. Form.C30H31F3N4O3
Mol. Mass.552.5873
SMILESCCN1CCN(Cc2ccc(cc2C(F)(F)F)C(=O)Nc2ccc(C)c(Oc3ccc4NC(=O)Cc4c3)c2)CC1