Reaction Details
TargetEpithelial discoidin domain-containing receptor 1
LigandBDBM50237710
Substrate/Competitorn/a
Meas. Tech.EC50 Test
IC50 43±0.0 nM
Citation Kim, HGTan, LWeisberg, ELLiu, FCanning, PChoi, HGEzell, SAWu, HZhao, ZWang, JMandinova, AGriffin, JDBullock, ANLiu, QLee, SWGray, NS Discovery of a potent and selective DDR1 receptor tyrosine kinase inhibitor. ACS Chem Biol8:2145-50 (2013) 
 
Epithelial discoidin domain-containing receptor 1
Name:Epithelial discoidin domain-containing receptor 1
Type:Tyrosine-protein kinase
Mol. Mass.:101130.02
Organism:Homo sapiens (Human)
Description:Q08345
Residue:913
BDBM50237710
NameBDBM50237710
Synonyms:4-methyl-N-[3-(4-methyl-1H-imidazol-1-yl)-5-(trifluoromethyl)phenyl]-3-[(4-pyridin-3-ylpyrimidin-2-yl)amino]benzamide AMN107 NILOTINIB | US11649218, Example Nilotinib
TypeSmall organic molecule
Emp. Form.C28H22F3N7O
Mol. Mass.529.5158
SMILESCc1cn(cn1)-c1cc(NC(=O)c2ccc(C)c(Nc3nccc(n3)-c3cccnc3)c2)cc(c1)C(F)(F)F