Reaction Details
TargetDiscoidin domain-containing receptor 2
LigandBDBM104010
Substrate/Competitorn/a
Meas. Tech.EC50 Test
IC50 145±0.0 nM
Citation Kim, HGTan, LWeisberg, ELLiu, FCanning, PChoi, HGEzell, SAWu, HZhao, ZWang, JMandinova, AGriffin, JDBullock, ANLiu, QLee, SWGray, NS Discovery of a potent and selective DDR1 receptor tyrosine kinase inhibitor. ACS Chem Biol8:2145-50 (2013) 
 
Discoidin domain-containing receptor 2
Name:Discoidin domain-containing receptor 2
Type:Protein
Mol. Mass.:96717.07
Organism:Homo sapiens (Human)
Description:Q16832
Residue:855
BDBM104010
NameBDBM104010
Synonyms:DDR1-IN-2
TypeSmall organic molecule
Emp. Form.C31H35F3N6O2
Mol. Mass.580.6438
SMILESCCN1CCN(Cc2ccc(cc2C(F)(F)F)C(=O)Nc2ccc(C)c(NCc3cnc4[nH]ccc4c3OC)c2)CC1