Reaction Details
TargetAndrogen receptor
LigandBDBM104035
Substrate/Competitorn/a
Meas. Tech.HDAC Activity Assay
Ki 2.60e+3±n/a nM
IC50 3.91e+3±n/a nM
Citation Gryder, BEAkbashev, MJRood, MKRaftery, EDMeyers, WMDillard, PKhan, SOyelere, AK Selectively targeting prostate cancer with antiandrogen equipped histone deacetylase inhibitors. ACS Chem Biol8:2550-60 (2013) 
 
Androgen receptor
Name:Androgen receptor
Type:Receptor
Mol. Mass.:99185.27
Organism:Homo sapiens (Human)
Description:CHO cells were stably transfected with human AR gene.
Residue:920
BDBM104035
NameBDBM104035
Synonyms:Alkyl Nilutamide HDACi analog 15d
TypeSmall organic molecule
Emp. Form.C26H32F3N7O4
Mol. Mass.563.572
SMILESCC1(C)N(CCCCc2cn(CCCCCCC(=O)NO)nn2)C(=O)N(C1=O)c1ccc(C#N)c(c1)C(F)(F)F