Reaction Details
TargetRho-associated protein kinase 2
LigandBDBM104065
Substrate/Competitorn/a
Meas. Tech.Kinome Profiling
IC50 200000±0.0 nM
Citation Carlson, DAFranke, ASWeitzel, DHSpeer, BLHughes, PFHagerty, LFortner, CNVeal, JMBarta, TEZieba, BJSomlyo, AVSutherland, CDeng, JTWalsh, MPMacdonald, JAHaystead, TA Fluorescence Linked Enzyme Chemoproteomic Strategy for Discovery of a Potent and Selective DAPK1 and ZIPK Inhibitor. ACS Chem Biol8:2715-23 (2013) 
 
Rho-associated protein kinase 2
Name:Rho-associated protein kinase 2
Type:Protein
Mol. Mass.:160885.43
Organism:Homo sapiens (Human)
Description:O75116
Residue:1388
BDBM104065
NameBDBM104065
Synonyms:HS38
TypeSmall organic molecule
Emp. Form.C14H12ClN5O2S
Mol. Mass.349.795
SMILESCC(Sc1nc2n(ncc2c(=O)[nH]1)-c1cccc(Cl)c1)C(N)=O