Reaction Details
TargetSerine/threonine-protein kinase pim-3
LigandBDBM104066
Substrate/Competitorn/a
Meas. Tech.Kinome Profiling
Kd 1600±0.0 nM
Citation Carlson, DAFranke, ASWeitzel, DHSpeer, BLHughes, PFHagerty, LFortner, CNVeal, JMBarta, TEZieba, BJSomlyo, AVSutherland, CDeng, JTWalsh, MPMacdonald, JAHaystead, TA Fluorescence Linked Enzyme Chemoproteomic Strategy for Discovery of a Potent and Selective DAPK1 and ZIPK Inhibitor. ACS Chem Biol8:2715-23 (2013) 
 
Serine/threonine-protein kinase pim-3
Name:Serine/threonine-protein kinase pim-3
Type:Protein
Mol. Mass.:35888.19
Organism:Homo sapiens (Human)
Description:Q86V86
Residue:326
BDBM104066
NameBDBM104066
Synonyms:HS43
TypeSmall organic molecule
Emp. Form.C13H11ClN4O2S
Mol. Mass.322.77
SMILESOCCSc1nc2n(ncc2c(=O)[nH]1)-c1cccc(Cl)c1