Reaction Details
TargetPeptidoglycan D,D-transpeptidase FtsI
LigandBDBM50240426
Substrate/Competitorn/a
Meas. Tech.IC50 Assay
pH7.2±n/a
Temperature298.15±n/a K
IC50 166±62 nM
Commentsextracted
Citation van Berkel, SSNettleship, JELeung, IKBrem, JChoi, HStuart, DIClaridge, TDMcDonough, MAOwens, RJRen, JSchofield, CJ Binding of (5S)-penicilloic acid to penicillin binding protein 3. ACS Chem Biol8:2112-6 (2013) 
 
Peptidoglycan D,D-transpeptidase FtsI
Name:Peptidoglycan D,D-transpeptidase FtsI
Synonyms:Penicillin binding protein 3 (PBP3)
Type:Protein
Mol. Mass.:62820.53
Organism:Pseudomonas aeruginosa
Description:A6VB91
Residue:579
BDBM50240426
NameBDBM50240426
TypeSmall organic molecule
Emp. Form.C23H27N5O7S
Mol. Mass.517.555
SMILESCCN1CCN(C(=O)N[C@@H](C(=O)N[C@H]2[C@H]3SC(C)(C)[C@@H](N3C2=O)C(O)=O)c2ccccc2)C(=O)C1=O