Reaction Details
TargetHIV-1 protease
LigandBDBM104101
Substrate/Competitorn/a
Meas. Tech.Inhibition Assay
Ki 0.046±0.023 nM
Citation Shen, YAltman, MDAli, ANalam, MNCao, HRana, TMSchiffer, CATidor, B Testing the substrate-envelope hypothesis with designed pairs of compounds. ACS Chem Biol8:2433-41 (2013) 
 
HIV-1 protease
Name:HIV-1 protease
Synonyms:HIV-1 protease wild type
Type:Protein
Mol. Mass.:10757.68
Organism:Human immunodeficiency virus
Description:O90785
Residue:99
BDBM104101
NameBDBM104101
Synonyms:MIT-2-AD-93 (AD-93)
TypeSmall organic molecule
Emp. Form.C29H33N3O5S2
Mol. Mass.567.719
SMILESCC[C@H](C)CN(C[C@@H](O)[C@H](Cc1ccccc1)NC(=O)c1cccc(O)c1)S(=O)(=O)c1ccc2ncsc2c1