Reaction Details
TargetHIV-1 protease
LigandBDBM104104
Substrate/Competitorn/a
Meas. Tech.Inhibition Assay
Ki 0.070±0.005 nM
Citation Shen, YAltman, MDAli, ANalam, MNCao, HRana, TMSchiffer, CATidor, B Testing the substrate-envelope hypothesis with designed pairs of compounds. ACS Chem Biol8:2433-41 (2013) 
 
HIV-1 protease
Name:HIV-1 protease
Synonyms:HIV-1 protease wild type
Type:Protein
Mol. Mass.:10757.68
Organism:Human immunodeficiency virus
Description:O90785
Residue:99
BDBM104104
NameBDBM104104
Synonyms:N-[(1S,2R)-3-[(6-Benzothiazolylsulfonyl)(3-phenylpropyl)amino]-2-hydroxy-1- (phenylmethyl)propyl]-3-hydroxy-benzamide (AF-69)
TypeSmall organic molecule
Emp. Form.C33H33N3O5S2
Mol. Mass.615.762
SMILESO[C@H](CN(CCCc1ccccc1)S(=O)(=O)c1ccc2ncsc2c1)[C@H](Cc1ccccc1)NC(=O)c1cccc(O)c1