Reaction Details
TargetGag-Pol polyprotein [484-582,I497V,V499I,E519D,G532V,I538V,R541K,D544E,Q553K,V566A,L573M]
LigandBDBM104104
Substrate/Competitorn/a
Meas. Tech.Inhibition Assay
Ki 19.18±3.84 nM
Citation Shen, YAltman, MDAli, ANalam, MNCao, HRana, TMSchiffer, CATidor, B Testing the substrate-envelope hypothesis with designed pairs of compounds. ACS Chem Biol8:2433-41 (2013) 
 
Gag-Pol polyprotein [484-582,I497V,V499I,E519D,G532V,I538V,R541K,D544E,Q553K,V566A,L573M]
Name:Gag-Pol polyprotein [484-582,I497V,V499I,E519D,G532V,I538V,R541K,D544E,Q553K,V566A,L573M]
Type:Protein
Mol. Mass.:10757.68
Organism:Human immunodeficiency virus
Description:Q9QBY3[484-582,I497V,V499I,E519D,G532V,I538V,R541K,D544E,Q553K,V566A,L573M]
Residue:99
BDBM104104
NameBDBM104104
Synonyms:N-[(1S,2R)-3-[(6-Benzothiazolylsulfonyl)(3-phenylpropyl)amino]-2-hydroxy-1- (phenylmethyl)propyl]-3-hydroxy-benzamide (AF-69)
TypeSmall organic molecule
Emp. Form.C33H33N3O5S2
Mol. Mass.615.762
SMILESO[C@H](CN(CCCc1ccccc1)S(=O)(=O)c1ccc2ncsc2c1)[C@H](Cc1ccccc1)NC(=O)c1cccc(O)c1