Reaction Details
TargetGag-Pol polyprotein [484-582,I494L,I497V,V499I,D514N,E519D,R541K,D544E,Q553K,N572D,L573M]
LigandBDBM104107
Substrate/Competitorn/a
Meas. Tech.Inhibition Assay
Ki 0.049±0.034 nM
Citation Shen, YAltman, MDAli, ANalam, MNCao, HRana, TMSchiffer, CATidor, B Testing the substrate-envelope hypothesis with designed pairs of compounds. ACS Chem Biol8:2433-41 (2013) 
 
Gag-Pol polyprotein [484-582,I494L,I497V,V499I,D514N,E519D,R541K,D544E,Q553K,N572D,L573M]
Name:Gag-Pol polyprotein [484-582,I494L,I497V,V499I,D514N,E519D,R541K,D544E,Q553K,N572D,L573M]
Type:Protein
Mol. Mass.:10757.68
Organism:Human immunodeficiency virus
Description:Q9QBY3[484-582,I494L,I497V,V499I,D514N,E519D,R541K,D544E,Q553K,N572D,L573M]
Residue:99
BDBM104107
NameBDBM104107
Synonyms:(2S,3S)-2-(Acetylamino)-N-[(1S,2R)-2-hydroxy-3-[[(4-methoxyphenyl)sulfonyl](2- methylpropyl)amino]-1-(phenylmethyl)propyl]-3-methyl-pentanamide (AF-68)
TypeSmall organic molecule
Emp. Form.C29H43N3O6S
Mol. Mass.561.733
SMILESCC[C@H](C)[C@H](NC(C)=O)C(=O)N[C@@H](Cc1ccccc1)[C@H](O)CN(CC(C)C)S(=O)(=O)c1ccc(OC)cc1