Reaction Details
TargetGag-Pol polyprotein [484-582,I494L,I497V,V499I,D514N,E519D,R541K,D544E,Q553K,N572D,L573M]
LigandBDBM104109
Substrate/Competitorn/a
Meas. Tech.Inhibition Assay
Ki 2.543±0.462 nM
Citation Shen, YAltman, MDAli, ANalam, MNCao, HRana, TMSchiffer, CATidor, B Testing the substrate-envelope hypothesis with designed pairs of compounds. ACS Chem Biol8:2433-41 (2013) 
 
Gag-Pol polyprotein [484-582,I494L,I497V,V499I,D514N,E519D,R541K,D544E,Q553K,N572D,L573M]
Name:Gag-Pol polyprotein [484-582,I494L,I497V,V499I,D514N,E519D,R541K,D544E,Q553K,N572D,L573M]
Type:Protein
Mol. Mass.:10757.68
Organism:Human immunodeficiency virus
Description:Q9QBY3[484-582,I494L,I497V,V499I,D514N,E519D,R541K,D544E,Q553K,N572D,L573M]
Residue:99
BDBM104109
NameBDBM104109
Synonyms:3-Hydroxy-N-[(1S,2R)-2-hydroxy-3-[[(4-methoxyphenyl)sulfonyl](3-phenylpropyl)amino]- 1-(phenylmethyl)propyl]-benzamide (AF-78)
TypeSmall organic molecule
Emp. Form.C33H36N2O6S
Mol. Mass.588.714
SMILESCOc1ccc(cc1)S(=O)(=O)N(CCCc1ccccc1)C[C@@H](O)[C@H](Cc1ccccc1)NC(=O)c1cccc(O)c1