Reaction Details
TargetGag-Pol polyprotein [484-582,I497V,V499I,E519D,R541K,D544E,Q553K,A555V,G557S,I568V,L574M,L573M]
LigandBDBM104102
Substrate/Competitorn/a
Meas. Tech.Inhibition Assay
Ki 0.048±0.022 nM
Citation Shen, YAltman, MDAli, ANalam, MNCao, HRana, TMSchiffer, CATidor, B Testing the substrate-envelope hypothesis with designed pairs of compounds. ACS Chem Biol8:2433-41 (2013) 
 
Gag-Pol polyprotein [484-582,I497V,V499I,E519D,R541K,D544E,Q553K,A555V,G557S,I568V,L574M,L573M]
Name:Gag-Pol polyprotein [484-582,I497V,V499I,E519D,R541K,D544E,Q553K,A555V,G557S,I568V,L574M,L573M]
Type:Protein
Mol. Mass.:10819.77
Organism:Human immunodeficiency virus
Description:Q9QBY3[484-582,I497V,V499I,E519D,R541K,D544E,Q553K,A555V,G557S,I568V,L574M,L573M]
Residue:99
BDBM104102
NameBDBM104102
Synonyms:(2S,3S)-2-(Acetylamino)-N-[(1S,2R)-3-[(6-benzothiazolylsulfonyl)[(2S)-2- methylbutyl]amino]-2-hydroxy-1-(phenylmethyl)propyl]-3-methyl-pentanamide (AG-23)
TypeSmall organic molecule
Emp. Form.C30H42N4O5S2
Mol. Mass.602.808
SMILESCC[C@H](C)CN(C[C@@H](O)[C@H](Cc1ccccc1)NC(=O)C(NC(C)=O)[C@@H](C)CC)S(=O)(=O)c1ccc2ncsc2c1