Reaction Details
TargetGag-Pol polyprotein [484-582,I494L,I497V,V499I,E519D,I534V,R541K,D544E,Q553K,A555V,L573M]
LigandBDBM104106
Substrate/Competitorn/a
Meas. Tech.Inhibition Assay
Ki 1.101±0.241 nM
Citation Shen, YAltman, MDAli, ANalam, MNCao, HRana, TMSchiffer, CATidor, B Testing the substrate-envelope hypothesis with designed pairs of compounds. ACS Chem Biol8:2433-41 (2013) 
 
Gag-Pol polyprotein [484-582,I494L,I497V,V499I,E519D,I534V,R541K,D544E,Q553K,A555V,L573M]
Name:Gag-Pol polyprotein [484-582,I494L,I497V,V499I,E519D,I534V,R541K,D544E,Q553K,A555V,L573M]
Type:Protein
Mol. Mass.:10771.71
Organism:Human immunodeficiency virus
Description:Q9QBY3[484-582,I494L,I497V,V499I,E519D,I534V,R541K,D544E,Q553K,A555V,L573M]
Residue:99
BDBM104106
NameBDBM104106
Synonyms:MIT-2-KB-83 (KB-83)
TypeSmall organic molecule
Emp. Form.C28H34N2O6S
Mol. Mass.526.644
SMILESCOc1ccc(cc1)S(=O)(=O)N(CC(C)C)C[C@@H](O)[C@H](Cc1ccccc1)NC(=O)c1cccc(O)c1