Reaction Details
TargetGag-Pol polyprotein [489-892]
LigandBDBM104103
Substrate/Competitorn/a
Meas. Tech.Drug Susceptibility Assay
EC50 63.7±0.0 nM
Citation Shen, YAltman, MDAli, ANalam, MNCao, HRana, TMSchiffer, CATidor, B Testing the substrate-envelope hypothesis with designed pairs of compounds. ACS Chem Biol8:2433-41 (2013) 
 
Gag-Pol polyprotein [489-892]
Name:Gag-Pol polyprotein [489-892]
Type:Protein
Mol. Mass.:46038.17
Organism:Human immunodeficiency virus
Description:P12497[489-892]
Residue:404
BDBM104103
NameBDBM104103
Synonyms:N-[(1S,2R)-3-[(6-Benzothiazolylsulfonyl)(cyclohexylmethyl)amino]-2-hydroxy-1- (phenylmethyl)propyl]-3-hydroxy-benzamide (AF-72)
TypeSmall organic molecule
Emp. Form.C31H35N3O5S2
Mol. Mass.593.757
SMILESO[C@H](CN(CC1CCCCC1)S(=O)(=O)c1ccc2ncsc2c1)[C@H](Cc1ccccc1)NC(=O)c1cccc(O)c1