Reaction Details
TargetHIV WT-A pol protein (wild-type clade A)
LigandBDBM104108
Substrate/Competitorn/a
Meas. Tech.Drug Susceptibility Assay
EC50 38.4±0.0 nM
Citation Shen, YAltman, MDAli, ANalam, MNCao, HRana, TMSchiffer, CATidor, B Testing the substrate-envelope hypothesis with designed pairs of compounds. ACS Chem Biol8:2433-41 (2013) 
 
HIV WT-A pol protein (wild-type clade A)
Name:HIV WT-A pol protein (wild-type clade A)
Type:Protein
Mol. Mass.:45854.50
Organism:Human immunodeficiency virus
Description:P12497[489-892,I502V,E524D,M525I,R530K,H558K,L578M,K599T,V609I,V623T,T627K,Q690K,C750S,T753I,K761S,D765E,V767I,T788A,I790V,Q795A,V833Q,E836D,A860P,R865K,K869R,T874A,E879D]
Residue:404
BDBM104108
NameBDBM104108
Synonyms:N-[(1S,2R)-3-[(Cyclohexylmethyl)[(4-methoxyphenyl)sulfonyl]amino]-2-hydroxy-1- (phenylmethyl)propyl]-3-hydroxy-benzamide (AF-77)
TypeSmall organic molecule
Emp. Form.C31H38N2O6S
Mol. Mass.566.708
SMILESCOc1ccc(cc1)S(=O)(=O)N(C[C@@H](O)[C@H](Cc1ccccc1)NC(=O)c1cccc(O)c1)CC1CCCCC1