Reaction Details
TargetHIV WT-C pol protein (wild-type clade C)
LigandBDBM577
Substrate/Competitorn/a
Meas. Tech.Drug Susceptibility Assay
EC50 3.7±0.0 nM
Citation Shen, YAltman, MDAli, ANalam, MNCao, HRana, TMSchiffer, CATidor, B Testing the substrate-envelope hypothesis with designed pairs of compounds. ACS Chem Biol8:2433-41 (2013) 
 
HIV WT-C pol protein (wild-type clade C)
Name:HIV WT-C pol protein (wild-type clade C)
Type:Protein
Mol. Mass.:45932.56
Organism:Human immunodeficiency virus
Description:P12497[489-892,I504V,M525I,R530K,H558K,L578M,I582L,V609I,V623T,E624A,T627E,E628D,K631R,Q690K,D711S,C750S,D765E,T788A,Q795E,R799K,P831S,V833E,D838E,A860P,R865K,E879D,V880I]
Residue:404
BDBM577
NameBDBM577
Synonyms:(3S)-oxolan-3-yl N-[(2S,3R)-4-[(4-aminobenzene)(2-methylpropyl)sulfonamido]-3-hydroxy-1-phenylbutan-2-yl]carbamate APV Amprenavir CHEMBL116 | VX-478
TypeSmall organic molecule
Emp. Form.C25H35N3O6S
Mol. Mass.505.627
SMILESCC(C)CN(C[C@@H](O)[C@H](Cc1ccccc1)NC(=O)O[C@H]1CCOC1)S(=O)(=O)c1ccc(N)cc1