Reaction Details
TargetSerine/threonine-protein kinase pim-1
LigandBDBM104213
Substrate/Competitorn/a
Meas. Tech.PIM-1 Enzyme Assay
pH7.4±0
Temperature295.15±0 K
IC50 0.4±0.0 nM
Citation Allen, SCeleste, LLDavis, TGDeLisle, RKGreschuk, JMGross, SDHicken, EJJackson, LJKallan, NCLyssikatos, JPMarmsater, FPMunson, MCPheneger, JRast, BRobinson, JESchlachter, STTopalov, GTWright, ADZhao, Q Triazolopyridine compounds as PIM kinase inhibitors US Patent US8575145 Publication Date 11/5/2013
 
Serine/threonine-protein kinase pim-1
Name:Serine/threonine-protein kinase pim-1
Type:Protein
Mol. Mass.:35681.82
Organism:Homo sapiens (Human)
Description:P11309
Residue:313
BDBM104213
NameBDBM104213
Synonyms:US8575145, 120 US8575145, 150 US8575145, 90 | US8575145, 91
TypeSmall organic molecule
Emp. Form.C21H19F2N5O
Mol. Mass.395.4053
SMILESFC1CCNCCC1Oc1cc(F)cc2ccc(nc12)-c1nnc2ccccn12