Reaction Details
TargetPhosphatidylinositol 4,5-bisphosphate 3-kinase catalytic subunit delta isoform
LigandBDBM50403068
Substrate/Competitorn/a
Meas. Tech.Biochemical Assay
IC50 9±0.0 nM
Citation Fowler, KWHuang, DKesicki, EAOoi, HCOliver, ARuan, FTreiberg, JPuri, KD Quinazolinones as inhibitors of human phosphatidylinositol 3-kinase delta US Patent US Patent
 
Phosphatidylinositol 4,5-bisphosphate 3-kinase catalytic subunit delta isoform
Name:Phosphatidylinositol 4,5-bisphosphate 3-kinase catalytic subunit delta isoform
Type:Enzyme Subunit
Mol. Mass.:119489.41
Organism:Homo sapiens (Human)
Description:O00329
Residue:1044
BDBM50403068
NameBDBM50403068
Synonyms:CHEMBL2216870 US9745321, CAL-101
TypeSmall organic molecule
Emp. Form.C22H18FN7O
Mol. Mass.415.423
SMILESCC[C@H](Nc1ncnc2nc[nH]c12)c1nc2cccc(F)c2c(=O)n1-c1ccccc1