Reaction Details
TargetArachidonate 5-lipoxygenase-activating protein
LigandBDBM104540
Substrate/Competitorn/a
Meas. Tech.Binding Assay
IC50 1.9±0.0 nM
Citation Bartolozzi, ABosanac, TChen, ZDe Lombaert, SDines, JAHuber, JDLiu, WWLoke, PLMorwick, TMOlague, ARiether, DTye, HWu, LZindell, RM Oxadiazole inhibitors of leukotriene production US Patent US8575201 Publication Date 11/5/2013
 
Arachidonate 5-lipoxygenase-activating protein
Name:Arachidonate 5-lipoxygenase-activating protein
Type:Enzyme
Mol. Mass.:18159.90
Organism:Homo sapiens (Human)
Description:P20292
Residue:161
BDBM104540
NameBDBM104540
Synonyms:US8575201, 31
TypeSmall organic molecule
Emp. Form.C23H19N9O
Mol. Mass.437.4567
SMILESNc1ncc(cn1)-c1ccc(cn1)C1(CCC1)c1noc(n1)-c1ccc(nc1)-n1ccnc1