Reaction Details
TargetArachidonate 5-lipoxygenase-activating protein
LigandBDBM104541
Substrate/Competitorn/a
Meas. Tech.Binding Assay
IC50 2.9±0.0 nM
Citation Bartolozzi, ABosanac, TChen, ZDe Lombaert, SDines, JAHuber, JDLiu, WWLoke, PLMorwick, TMOlague, ARiether, DTye, HWu, LZindell, RM Oxadiazole inhibitors of leukotriene production US Patent US8575201 Publication Date 11/5/2013
 
Arachidonate 5-lipoxygenase-activating protein
Name:Arachidonate 5-lipoxygenase-activating protein
Type:Enzyme
Mol. Mass.:18159.90
Organism:Homo sapiens (Human)
Description:P20292
Residue:161
BDBM104541
NameBDBM104541
Synonyms:US8575201, 32
TypeSmall organic molecule
Emp. Form.C21H18N6O2
Mol. Mass.386.4066
SMILESNc1ncc(cn1)-c1ccc(cn1)C1(CCC1)c1noc(n1)-c1ccc(O)cc1